Home > Configure Error > Configure Error C Compiler Cannot Create Executables Ubuntu 11.10

Configure Error C Compiler Cannot Create Executables Ubuntu 11.10

I tried the ./configure command again with no variables and all went well. configure:2413: $? = 1 configure:2433: checking whether the C++ compiler works ... Host OS? - Ubuntu 11.10 - 32bit VM 2. it works!! http://entrelinks.com/configure-error/configure-error-c-compiler-cannot-create-executables-ubuntu-10-04.php

yes checking for a thread-safe mkdir -p... /bin/mkdir -p checking for gawk... Search this Thread 11-12-2011, 07:32 AM #1 daniv LQ Newbie Registered: Nov 2011 Location: Italy Distribution: Ubuntu 10.11 Posts: 3 Rep: Error during configure: C compiler cannot create executables How to separate the schematic of a RGB LED into 3 individual LEDs in Altium? For more advanced trainees it can be a desktop reference, and a collection of the base knowledge needed to proceed with system and network administration. http://askubuntu.com/questions/647583/how-to-fix-configure-error-c-compiler-cannot-create-executables

For details and our forum data attribution, retention and privacy policy, see here current community chat Stack Overflow Meta Stack Overflow your communities Sign up or log in to customize your configure:3240: $? = 0 configure:3280: tardir=conftest.dir && eval tar --format=ustar -chf - "$tardir" >conftest.tar configure:3283: $? = 0 configure:3287: tar -xf - ► 2016 (2) ► August (1) ► March (1) ► 2015 (4) ► October (2) ► May (1) ► April (1) ► 2014 (3) ►

daniv View Public Profile View LQ Blog View Review Entries View HCL Entries Find More Posts by daniv 12-13-2011, 03:49 PM #7 enrico.bacis LQ Newbie Registered: Dec 2011 Posts: Was Donald Trump's father a member of the KKK? no checking for style of include used by make... None of those are usable for cyclone-1.0 : gcc-3.x.x is required.

There were few solution given online like installing 'kernel-devel' package but it did not resolve issue. configure:3869: $? = 4 configure:3858: gcc -qversion >&5 gcc: error: unrecognized option '-qversion' gcc: fatal error: no input files compilation terminated. Sugarbay - is that what you're looking for? 6. http://www.linuxquestions.org/questions/linux-software-2/error-during-configure-c-compiler-cannot-create-executables-913156/ Which version of Yocto eclipse plugin? - I just tried to get it as per the manual but the link on the ADT manual for the plugin is broken.

Want to know which application is best for the job? Frankly, you should go find the package maintainers and open a bug. –phs Jul 15 '12 at 10:16 add a comment| Your Answer draft saved draft discarded Sign up or Invocation command line was $ ./configure ## --------- ## ## Platform. ## ## --------- ## hostname = daniele-notebook uname -m = i686 uname -r = 3.0.0-12-generic-pae uname -s = Linux uname Code: $ ./configure checking for a BSD-compatible install... /usr/bin/install -c checking whether build environment is sane...

  1. Invocation command line was $ ./configure --prefix=/home/ubuntu/.bundler/tmp/1841/gems/xapian-core- --exec-prefix=/home/ubuntu/.bundler/tmp/1841/gems/xapian-core- ## --------- ## ## Platform. ## ## --------- ## hostname = ip-10-28-13-19 uname -m = i686 uname -r = 3.0.0-16-virtual uname -s =
  2. I issued ./configure and the output was the following: Code: checking build system type...
  3. The CFLAGS answers appear to be correct.] share|improve this answer edited Jul 13 '15 at 17:44 answered Jul 12 '15 at 17:19 Colin Watson 4,4651921 libc6-dev is already the
  4. Join them; it only takes a minute: Sign up gcc error cannot compile exectables while installing xapian-core up vote 0 down vote favorite Iam getting the error while installing the gem

How does a laptop power adapter automatically "adapt" to world voltages and frequencies getting cowsay to send one word at a time in putty Qubit passing through quantum gate animation Are http://stackoverflow.com/questions/11490955/gcc-error-cannot-compile-exectables-while-installing-xapian-core configure: error: C compiler cannot create executables See `config.log' for more details. It was created by configure, which was generated by GNU Autoconf 2.67. [email protected] _______________________________________________ yocto mailing list [email protected] https://lists.yoctoproject.org/listinfo/yocto Previous message View by thread View by date Next message Re: [yocto] Eclipse-ADT-build-error (Lu, Lianhao) Andy Gikling Re: [yocto] Eclipse-ADT-build-error (Lu, Lianhao) Andy Gikling

Invocation command line was $ ./configure ## --------- ## ## Platform. ## ## --------- ## hostname = delta uname -m = i686 uname -r = 2.6.12-10-386 uname -s = Linux uname news I'm having the same problem Lu seems to be having. any help would be great as the compiler fails on anytime I try to use it, not just with this install. Visit the following links: Site Howto | Site FAQ | Sitemap | Register Now If you have any problems with the registration process or your account login, please contact us.

Not the answer you're looking for? I'll try to get >> confirmation for that. The config.log shows this snippet as the culprit: ... http://entrelinks.com/configure-error/configure-error-c-compiler-cannot-create-executables-os-x.php Browse other questions tagged command-line compiling gcc make or ask your own question.

It was created by hearts configure 0.1, which was generated by GNU Autoconf 2.59. yes checking whether make supports nested variables... Is it possible to check the BIOS version of my computer on Ubuntu?

This is from the intput to configure here: --host=x86_32-unknown-linux-gnu host_alias=x86_32-unknown-linux-gnu CFLAGS=-m32 LDFLAGS=-m32 Also see the output lines confirming this: configure:3629: checking build system type configure:3643: result: x86_64-unknown-linux-gnu configure:3663: checking host system

Post a reply to this message From: Ger Subject: Re: RC7 compilation issues on ubuntu 12.10 Date: 26 Feb 2013 22:46:00 Message: <[email protected]> Bruno Cabasson wrote: > I recently installed ubuntu yes checking for a BSD-compatible install... /usr/bin/install -c checking whether NLS is requested... Adv Reply May 14th, 2006 #3 mmcmonster View Profile View Forum Posts Private Message Cookies and cream Join Date Mar 2005 Location Pennsylvania Beans 384 DistroUbuntu 11.10 Oneiric Ocelot Re: What does it mean?

Newer Post Older Post Home Subscribe to: Post Comments (Atom) About Me G. After > download of Pov-Ray sources, ./configure says: > > configure: error: in `/home/bruno/Documents/povray-3.7.0.RC7': > configure: error: C++ compiler cannot create executables > > and config.log ends abruptly by: > > Do you have gcc installed? check my blog more stack exchange communities company blog Stack Exchange Inbox Reputation and Badges sign up log in tour help Tour Start here for a quick overview of the site Help Center Detailed

How to separate the schematic of a RGB LED into 3 individual LEDs in Altium? If so, I'll reinstall it all. :( > > Isn't it great how Linux wins big time over Windows in that it won't get > irrevocably fucked up over time as It was created by cyclone configure 1.0, which was generated by GNU Autoconf 2.57. The existing apache 2.2.15 was compiled with m32 flag.

If using meta-toolchain tarball, which version do you use? - used the premade tarball from: http://downloads.yoctoproject.org/releases/yocto/yocto-1.1.1/toolchain/i686/poky-eglibc-i686-arm-toolchain-gmae-1.1.1.tar.bz2 - once extracted, in Ecplise, I point at /opt/poky/1.1.1 for my Toolchain Root and /opt/poky/1.1.1/sysroots/ What I have to do? configure: error: C compiler cant create executables Thread Tools Show Printable Version Subscribe to this Thread… Display Linear Mode Switch to Hybrid Mode Switch to Threaded Mode May 14th, 2006 #1 What was the first sentient race that awoke on Arda?

Much appreciated!-TReplyDeleteAdd commentLoad more... configure: error: C compiler cant create executables try running sudo apt-get install build-essential from ythe command line. You are currently viewing LQ as a guest. Try which gcc On debian you probably need to install a build environment with apt-get install build-essential or even better apt-get build-dep you-package-name .

but I must $ sudo apt-get remove build-essential then $ sudo apt-get install build-essential Adv Reply Quick Navigation Packaging and Compiling Programs Top Site Areas Settings Private Messages Subscriptions Who's You probably need cpp as well, that may not be installed (not a Debian guy myself, so I don't know precisely what packages are needed). Is there any kind of monument or marker for the Tropic of Cancer along the coast on the east side of Taiwan? Blogs Recent Entries Best Entries Best Blogs Blog List Search Blogs Home Forums HCL Reviews Tutorials Articles Register Search Search Forums Advanced Search Search Tags Search LQ Wiki Search Tutorials/Articles Search

Done build-essential is already the newest version. 0 upgraded, 0 newly installed, 0 to remove and 0 not upgraded. $ Contents of config.log: Code: This file contains any messages produced by If not, why? Join them; it only takes a minute: Sign up Here's how it works: Anybody can ask a question Anybody can answer The best answers are voted up and rise to the